BDBM50073008 CHEMBL3410695
SMILES CCCCOc1cccc2cc(C(=O)NC3CCCCC3)c(=O)oc12
InChI Key InChIKey=NDRADVRRQGHCEF-UHFFFAOYSA-N
Data  2 EC50
  Tab Delimited (TSV)   2D SDfile   Computed 3D by Vconf -m prep SDfile
Find this compound or compounds like it in BindingDB:
Activity Spreadsheet -- Enzyme Inhibition Constant Data from BindingDB
Found 2 hits for monomerid = 50073008
TargetCannabinoid receptor 2(Homo sapiens (Human))
Zhejiang University
Curated by ChEMBL
LigandPNGBDBM50073008(CHEMBL3410695)
Affinity DataEC50:  144nM. Assay description: Agonist activity at CB2 receptor (unknown origin) expressed in CHO cells by calcium mobilization assay
In DepthDetails ArticlePubMed
TargetCannabinoid receptor 1(Homo sapiens (Human))
Zhejiang University
Curated by ChEMBL
LigandPNGBDBM50073008(CHEMBL3410695)
Affinity DataEC50: >1.00E+4nM. Assay description: Agonist activity at CB1 receptor (unknown origin) expressed in CHO cells by calcium mobilization assay
In DepthDetails ArticlePubMed