BDBM50073236 CHEMBL3408642
SMILES C\C(=N/NC(N)=S)c1cccc(NC(=O)c2ccccc2)c1
InChI Key InChIKey=POMQYEYUUKGEBF-YBFXNURJSA-N
Data  1 IC50
  Tab Delimited (TSV)   2D SDfile   Computed 3D by Vconf -m prep SDfile
Find this compound or compounds like it in BindingDB:
Activity Spreadsheet -- Enzyme Inhibition Constant Data from BindingDB
Found 1 hit for monomerid = 50073236
TargetPolyphenol oxidase 2(Agaricus bisporus (Common mushroom))
Sun Yat-Sen University
Curated by ChEMBL
LigandPNGBDBM50073236(CHEMBL3408642)
Affinity DataIC50:  1.53E+3nM. Assay description: Inhibition of mushroom tyrosinase diphenolase activity using L-DOPA as substrate preincubated for 30 mins followed by substrate addition measured for...
In DepthDetails ArticlePubMed