BDBM50073264 CHEMBL118531::{2-[(1S,3S,4S)-4-(4-Amino-benzoylamino)-1-benzyl-3-hydroxy-5-phenyl-pentylcarbamoyl]-phenyl}-carbamic acid pyridin-2-ylmethyl ester
SMILES Nc1ccc(cc1)C(=O)N[C@@H](Cc1ccccc1)[C@@H](O)C[C@H](Cc1ccccc1)NC(=O)c1ccccc1NC(=O)OCc1ccccn1
InChI Key InChIKey=HWTPETMRNREMLV-PUBVIUOISA-N
Data  1 KI
  Tab Delimited (TSV)   2D SDfile   Computed 3D by Vconf -m prep SDfile
Find this compound or compounds like it in BindingDB:
Activity Spreadsheet -- Enzyme Inhibition Constant Data from BindingDB
Found 1 hit for monomerid = 50073264
TargetGag-Pol polyprotein [489-587](Human immunodeficiency virus type 1)
Aids Drug Screening And Development Laboratory
Curated by ChEMBL
LigandPNGBDBM50073264(CHEMBL118531 | {2-[(1S,3S,4S)-4-(4-Amino-benzoylam...)
Affinity DataKi:  1.5nM. Assay description: Inhibitory activity against HIV protease
In DepthDetails ArticlePubMed