BDBM50073324 CHEMBL333098::N-(3-Guanidino-3-oxo-propyl)-2-((S)-2-oxo-3-phenylmethanesulfonylamino-azepan-1-yl)-acetamide
SMILES NC(=N)NC(=O)CCNC(=O)CN1CCCC[C@H](NS(=O)(=O)Cc2ccccc2)C1=O
InChI Key InChIKey=RPWCQFSJVMOKQP-HNNXBMFYSA-N
Data  1 IC50
  Tab Delimited (TSV)   2D SDfile   Computed 3D by Vconf -m prep SDfile
Find this compound or compounds like it in BindingDB:
Activity Spreadsheet -- Enzyme Inhibition Constant Data from BindingDB
Found 1 hit for monomerid = 50073324
TargetProthrombin(Homo sapiens (Human))
Nv Organon Scientific Development Group
Curated by ChEMBL
LigandPNGBDBM50073324(CHEMBL333098 | N-(3-Guanidino-3-oxo-propyl)-2-((S)...)
Affinity DataIC50:  7.30E+4nM. Assay description: Inhibition of thrombin (IIa)
In DepthDetails ArticlePubMed