BDBM50073536 CHEMBL3408923
SMILES Clc1ccc(\C=N\NC(=O)Cn2c3ccccc3nc(Cc3ccccc3)c2=O)cc1
InChI Key InChIKey=RCDOIMGQNTWHHM-CVKSISIWSA-N
Data  2 IC50
  Tab Delimited (TSV)   2D SDfile   Computed 3D by Vconf -m prep SDfile
Find this compound or compounds like it in BindingDB:
Activity Spreadsheet -- Enzyme Inhibition Constant Data from BindingDB
Found 2 hits for monomerid = 50073536
TargetAmine oxidase [flavin-containing] B(Bos taurus)
Alexandria University
Curated by ChEMBL
LigandPNGBDBM50073536(CHEMBL3408923)
Affinity DataIC50:  9.60E+5nM. Assay description: Inhibition of bovine brain MAO-B preincubated for 60 mins before substrate addition by fluorimetric method
In DepthDetails ArticlePubMed
TargetAmine oxidase [flavin-containing] A(Bos taurus)
Alexandria University
Curated by ChEMBL
LigandPNGBDBM50073536(CHEMBL3408923)
Affinity DataIC50:  8.40nM. Assay description: Inhibition of bovine brain MAO-A preincubated for 60 mins before substrate addition by fluorimetric method
In DepthDetails ArticlePubMed