BDBM50073761 CHEMBL368278::N*2*-((1S,3R)-3-Amino-cyclohexyl)-N*6*-(3-chloro-phenyl)-9-ethyl-9H-purine-2,6-diamine
SMILES CCn1cnc2c(Nc3cccc(Cl)c3)nc(N[C@H]3CCC[C@@H](N)C3)nc12
InChI Key InChIKey=JXZIZOIXGMUPSK-HIFRSBDPSA-N
Data  4 IC50
  Tab Delimited (TSV)   2D SDfile   Computed 3D by Vconf -m prep SDfile
Find this compound or compounds like it in BindingDB:
Activity Spreadsheet -- Enzyme Inhibition Constant Data from BindingDB
Found 4 hits for monomerid = 50073761
TargetCyclin-dependent kinase 1(Homo sapiens (Human))
Novartis Pharmaceuticals
Curated by ChEMBL
LigandPNGBDBM50073761(CHEMBL368278 | N*2*-((1S,3R)-3-Amino-cyclohexyl)-N...)
Affinity DataIC50:  120nM. Assay description: Inhibitory activity against cyclin-dependent kinase 1 (CDK1) was determined
In DepthDetails ArticlePubMed
TargetEpidermal growth factor receptor(Homo sapiens (Human))
Novartis Pharmaceuticals
Curated by ChEMBL
LigandPNGBDBM50073761(CHEMBL368278 | N*2*-((1S,3R)-3-Amino-cyclohexyl)-N...)
Affinity DataIC50:  5.30E+3nM. Assay description: Inhibit of epidermal growth factor receptor (EGFR)
In DepthDetails ArticlePubMed
TargetcAMP-dependent protein kinase catalytic subunit alpha/beta/gamma(Homo sapiens (Human))
Novartis Pharmaceuticals
Curated by ChEMBL
LigandPNGBDBM50073761(CHEMBL368278 | N*2*-((1S,3R)-3-Amino-cyclohexyl)-N...)
Affinity DataIC50:  1.30E+5nM. Assay description: Inhibition of Protein kinase A
In DepthDetails ArticlePubMed
TargetProtein kinase C alpha type(Homo sapiens (Human))
Novartis Pharmaceuticals
Curated by ChEMBL
LigandPNGBDBM50073761(CHEMBL368278 | N*2*-((1S,3R)-3-Amino-cyclohexyl)-N...)
Affinity DataIC50:  6.00E+3nM. Assay description: Inhibition of Protein kinase C alpha
In DepthDetails ArticlePubMed