BDBM50073948 CHEMBL40225
SMILES CCO\C(O)=C1\C(C(C(=O)OCC)=C(C)N=C1C)c1cccc(O)c1
InChI Key InChIKey=ZUFHZQQDPOXHRM-OBGWFSINSA-N
Data  1 IC50
  Tab Delimited (TSV)   2D SDfile   Computed 3D by Vconf -m prep SDfile
Find this compound or compounds like it in BindingDB:
Activity Spreadsheet -- Enzyme Inhibition Constant Data from BindingDB
Found 1 hit for monomerid = 50073948
TargetOligo-1,6-glucosidase IMA1(Saccharomyces cerevisiae S288c (Baker's yeast))
University Of Karachi
Curated by ChEMBL
LigandPNGBDBM50073948(CHEMBL40225)
Affinity DataIC50: <5.00E+4nM. Assay description: Inhibition of Saccharomyces cerevisiae alpha-glucosidase using p-nitrophenyl alpha-D-glucopyranoside as substrate preincubated for 15 mins measured u...
In DepthDetails ArticlePubMed