BDBM50073976 1,1,1-Trifluoro-octan-2-one::1,1,1-trifluorooctan-2-one::CHEMBL90719
SMILES CCCCCCC(=O)C(F)(F)F
InChI Key InChIKey=DPXNESFWZZBKJM-UHFFFAOYSA-N
Data  3 KI  1 IC50
  Tab Delimited (TSV)   2D SDfile   Computed 3D by Vconf -m prep SDfile
Find this compound or compounds like it in BindingDB:
Activity Spreadsheet -- Enzyme Inhibition Constant Data from BindingDB
Found 4 hits for monomerid = 50073976
TargetFatty-acid amide hydrolase 1 [30-579](Rattus norvegicus (rat))
Scripps Research Institute
Curated by ChEMBL
LigandPNGBDBM50073976(1,1,1-Trifluoro-octan-2-one | 1,1,1-trifluorooctan...)
Affinity DataKi:  1.07E+4nM. Assay description: Inhibitory constant of the compound against Fatty-acid amide hydrolase (FAAH) in rat liver
In DepthDetails ArticlePubMed
TargetFatty-acid amide hydrolase 1 [30-579](Rattus norvegicus (rat))
Scripps Research Institute
Curated by ChEMBL
LigandPNGBDBM50073976(1,1,1-Trifluoro-octan-2-one | 1,1,1-trifluorooctan...)
Affinity DataKi:  1.07E+4nM. Assay description: Inhibition of rat FAAH assessed as conversion [14]C-oleamide to oleic acid
In DepthDetails ArticlePubMed
TargetFatty-acid amide hydrolase 1(Homo sapiens (Human))
Johnson & Johnson Pharmaceutical Research And Development
Curated by ChEMBL
LigandPNGBDBM50073976(1,1,1-Trifluoro-octan-2-one | 1,1,1-trifluorooctan...)
Affinity DataKi:  1.07E+4nM. Assay description: Inhibition of FAAH
In DepthDetails ArticlePubMed
TargetFatty-acid amide hydrolase 1 [30-579](Rattus norvegicus (rat))
Scripps Research Institute
Curated by ChEMBL
LigandPNGBDBM50073976(1,1,1-Trifluoro-octan-2-one | 1,1,1-trifluorooctan...)
Affinity DataIC50:  5.28E+4nM. Assay description: Inhibitory constant of the compound against Fatty-acid amide hydrolase (FAAH) in rat liver
In DepthDetails ArticlePubMed