BDBM50074039 CHEMBL265798::[3-Oxo-4-phenethyl-8-(4-piperidin-4-yl-butyl)-2,3,4,5-tetrahydro-1H-benzo[e][1,4]diazepin-2-yl]-acetic acid
SMILES OC(=O)CC1Nc2cc(CCCCC3CCNCC3)ccc2CN(CCc2ccccc2)C1=O
InChI Key InChIKey=QEAOZWGCEHCEMH-UHFFFAOYSA-N
Data  1 KI
  Tab Delimited (TSV)   2D SDfile   Computed 3D by Vconf -m prep SDfile
Find this compound or compounds like it in BindingDB:
Activity Spreadsheet -- Enzyme Inhibition Constant Data from BindingDB
Found 1 hit for monomerid = 50074039
TargetIntegrin alpha-IIb/beta-3(Homo sapiens (Human))
Smithkline Beecham Pharmaceuticals
Curated by ChEMBL
LigandPNGBDBM50074039(CHEMBL265798 | [3-Oxo-4-phenethyl-8-(4-piperidin-4...)
Affinity DataKi:  80nM. Assay description: Fibrinogen receptor binding affinity was determined by assaying for inhibition of [3H]-1 binding to purified Fibrinogen Receptor isolated from human...
In DepthDetails ArticlePubMed