BDBM50074056 CHEMBL3409873
SMILES COc1cccc(F)c1[C@@H]1C[C@H](F)C(=O)N1Cc1ccc2oc3ccccc3c2c1
InChI Key InChIKey=YLZAYQGWWQGQAW-OALUTQOASA-N
Data  3 IC50
  Tab Delimited (TSV)   2D SDfile   Computed 3D by Vconf -m prep SDfile
Find this compound or compounds like it in BindingDB:
Activity Spreadsheet -- Enzyme Inhibition Constant Data from BindingDB
Found 3 hits for monomerid = 50074056
TargetOrexin/Hypocretin receptor type 1(Homo sapiens (Human))
Actelion Pharmaceuticals
Curated by ChEMBL
LigandPNGBDBM50074056(CHEMBL3409873)
Affinity DataIC50:  81nM. Assay description: Antagonist activity at human orexin 2 receptor expressed in CHO cells assessed as inhibition of orexin-A-induced calcium mobilization by FLIPR assay
In DepthDetails ArticlePubMed
TargetCytochrome P450 3A4(Homo sapiens (Human))
Actelion Pharmaceuticals
Curated by ChEMBL
LigandPNGBDBM50074056(CHEMBL3409873)
Affinity DataIC50:  2.10E+4nM. Assay description: Inhibition of CYP3A4 (unknown origin) using testosterone as marker substrate
In DepthDetails ArticlePubMed
TargetOrexin receptor type 2(Homo sapiens (Human))
Actelion Pharmaceuticals
Curated by ChEMBL
LigandPNGBDBM50074056(CHEMBL3409873)
Affinity DataIC50:  2nM. Assay description: Antagonist activity at human orexin 1 receptor expressed in CHO cells assessed as inhibition of orexin-A-induced calcium mobilization by FLIPR assay
In DepthDetails ArticlePubMed