BDBM50074094 CHEMBL3409868
SMILES COc1cccc(OC)c1[C@@H]1C[C@@H](N(C)C)C(=O)N1Cc1ccc(OC(F)(F)F)cc1
InChI Key InChIKey=YADKIADCRYTVEU-DLBZAZTESA-N
Data  2 IC50
  Tab Delimited (TSV)   2D SDfile   Computed 3D by Vconf -m prep SDfile
Find this compound or compounds like it in BindingDB:
Activity Spreadsheet -- Enzyme Inhibition Constant Data from BindingDB
Found 2 hits for monomerid = 50074094
TargetOrexin receptor type 2(Homo sapiens (Human))
Actelion Pharmaceuticals
Curated by ChEMBL
LigandPNGBDBM50074094(CHEMBL3409868)
Affinity DataIC50: >1.00E+4nM. Assay description: Antagonist activity at human orexin 1 receptor expressed in CHO cells assessed as inhibition of orexin-A-induced calcium mobilization by FLIPR assay
In DepthDetails ArticlePubMed
TargetOrexin/Hypocretin receptor type 1(Homo sapiens (Human))
Actelion Pharmaceuticals
Curated by ChEMBL
LigandPNGBDBM50074094(CHEMBL3409868)
Affinity DataIC50:  3.62E+3nM. Assay description: Antagonist activity at human orexin 2 receptor expressed in CHO cells assessed as inhibition of orexin-A-induced calcium mobilization by FLIPR assay
In DepthDetails ArticlePubMed