BDBM50074195 3-(3-Morpholin-4-yl-propyl)-5-[1,2,4]triazol-4-yl-1H-indole::CHEMBL162930
SMILES C(CN1CCOCC1)Cc1c[nH]c2ccc(cc12)-n1cnnc1
InChI Key InChIKey=KUHRWWPWIOEZCW-UHFFFAOYSA-N
Data  2 IC50
  Tab Delimited (TSV)   2D SDfile   Computed 3D by Vconf -m prep SDfile
Find this compound or compounds like it in BindingDB:
Activity Spreadsheet -- Enzyme Inhibition Constant Data from BindingDB
Found 2 hits for monomerid = 50074195
Target5-hydroxytryptamine receptor 1D(Homo sapiens (Human))
Merck Sharp And Dohme Research Laboratories
Curated by ChEMBL
LigandPNGBDBM50074195(3-(3-Morpholin-4-yl-propyl)-5-[1,2,4]triazol-4-yl-...)
Affinity DataIC50:  8.80nM. Assay description: Displacement of [3H]-5-HT binding to the cloned human 5-hydroxytryptamine 1D receptor stably expressed in CHO cells
In DepthDetails ArticlePubMed
Target5-hydroxytryptamine receptor 1B(Homo sapiens (Human))
Merck Sharp And Dohme Research Laboratories
Curated by ChEMBL
LigandPNGBDBM50074195(3-(3-Morpholin-4-yl-propyl)-5-[1,2,4]triazol-4-yl-...)
Affinity DataIC50:  7.40nM. Assay description: Displacement of [3H]-5-HT binding from cloned human 5-hydroxytryptamine 1B receptor stably expressed in CHO cells.
In DepthDetails ArticlePubMed