BDBM50074316 5-(4-Bromo-phenyl)-1-(2,4-dichloro-phenyl)-4-methyl-1H-pyrazole-3-carboxylic acid azepan-1-ylamide::CHEMBL36569
SMILES Cc1c(nn(c1-c1ccc(Br)cc1)-c1ccc(Cl)cc1Cl)C(=O)NN1CCCCCC1
InChI Key InChIKey=QEQITHSHGOQMTB-UHFFFAOYSA-N
Data  3 KI
  Tab Delimited (TSV)   2D SDfile   Computed 3D by Vconf -m prep SDfile
Find this compound or compounds like it in BindingDB:
Activity Spreadsheet -- Enzyme Inhibition Constant Data from BindingDB
Found 3 hits for monomerid = 50074316
TargetCannabinoid receptor 1(Rattus norvegicus (rat))
University Of Connecticut
Curated by ChEMBL
LigandPNGBDBM50074316(5-(4-Bromo-phenyl)-1-(2,4-dichloro-phenyl)-4-methy...)
Affinity DataKi:  7.85nM. Assay description: Binding affinity against Cannabinoid receptor 1 in rat forebrain
In DepthDetails ArticlePubMed
TargetCannabinoid receptor 1(Rattus norvegicus (rat))
University Of Connecticut
Curated by ChEMBL
LigandPNGBDBM50074316(5-(4-Bromo-phenyl)-1-(2,4-dichloro-phenyl)-4-methy...)
Affinity DataKi:  7.85nM. Assay description: Inhibition of [3H]-CP-55,940 binding to cannabinoid receptor 1 in rat brain membranes.
In DepthDetails ArticlePubMed
TargetCannabinoid receptor 2(MOUSE)
University Of Connecticut
Curated by ChEMBL
LigandPNGBDBM50074316(5-(4-Bromo-phenyl)-1-(2,4-dichloro-phenyl)-4-methy...)
Affinity DataKi:  215nM. Assay description: Binding affinity against Cannabinoid receptor 2 in mouse spleen
In DepthDetails ArticlePubMed