BDBM50074317 1-(2,4-Dichloro-phenyl)-4-methyl-5-(2-nitro-phenyl)-1H-pyrazole-3-carboxylic acid piperidin-1-ylamide::CHEMBL349513
SMILES Cc1c(nn(c1-c1ccccc1[N+]([O-])=O)-c1ccc(Cl)cc1Cl)C(=O)NN1CCCCC1
InChI Key InChIKey=PCVCLOUEFLONHJ-UHFFFAOYSA-N
Data  2 KI
  Tab Delimited (TSV)   2D SDfile   Computed 3D by Vconf -m prep SDfile
Find this compound or compounds like it in BindingDB:
Activity Spreadsheet -- Enzyme Inhibition Constant Data from BindingDB
Found 2 hits for monomerid = 50074317
TargetCannabinoid receptor 1(Rattus norvegicus (rat))
University Of Connecticut
Curated by ChEMBL
LigandPNGBDBM50074317(1-(2,4-Dichloro-phenyl)-4-methyl-5-(2-nitro-phenyl...)
Affinity DataKi:  255nM. Assay description: Binding affinity against Cannabinoid receptor 1 in rat forebrain
In DepthDetails ArticlePubMed
TargetCannabinoid receptor 2(MOUSE)
University Of Connecticut
Curated by ChEMBL
LigandPNGBDBM50074317(1-(2,4-Dichloro-phenyl)-4-methyl-5-(2-nitro-phenyl...)
Affinity DataKi:  691nM. Assay description: Binding affinity against Cannabinoid receptor 2 in mouse spleen
In DepthDetails ArticlePubMed