BDBM50074660 (S)-2-[(S)-3-Carboxy-2-((S)-4-methyl-2-{2-[4-(3-phenyl-ureido)-phenyl]-acetylamino}-pentanoylamino)-propionylamino]-3-methyl-butyric acid::CHEMBL353994
SMILES CC(C)C[C@H](NC(=O)Cc1ccc(NC(=O)Nc2ccccc2)cc1)C(=O)N[C@@H](CC(O)=O)C(=O)N[C@@H](C(C)C)C(O)=O
InChI Key InChIKey=VQHQPYCQKWFGNA-FXSPECFOSA-N
Data  2 IC50
  Tab Delimited (TSV)   2D SDfile   Computed 3D by Vconf -m prep SDfile
Find this compound or compounds like it in BindingDB:
Activity Spreadsheet -- Enzyme Inhibition Constant Data from BindingDB
Found 2 hits for monomerid = 50074660
TargetIntegrin alpha-4/beta-1(Homo sapiens (Human))
Biogen
Curated by ChEMBL
LigandPNGBDBM50074660((S)-2-[(S)-3-Carboxy-2-((S)-4-methyl-2-{2-[4-(3-ph...)
Affinity DataIC50:  30nM. Assay description: Inhibition of integrin alpha4-beta1 adhesion to Jurkat cells
In DepthDetails ArticlePubMed
TargetIntegrin alpha-4/beta-1(Homo sapiens (Human))
Biogen
Curated by ChEMBL
LigandPNGBDBM50074660((S)-2-[(S)-3-Carboxy-2-((S)-4-methyl-2-{2-[4-(3-ph...)
Affinity DataIC50:  3nM. Assay description: Inhibition of integrin alpha4-beta1 binding to VCAM-Ig
In DepthDetails ArticlePubMed