BDBM50074919 Morpholine-4-carboxylic acid [(R)-2,2-dimethyl-1-({[3,3,3-trifluoro-1-(4-guanidino-benzyl)-2-oxo-propylcarbamoyl]-methyl}-carbamoyl)-propyl]-amide
SMILES CC(C)(C)[C@@H](NC(=O)N1CCOCC1)C(=O)NCC(=O)NC(Cc1ccc(NC(N)=[NH2+])cc1)C(=O)C(F)(F)F
InChI Key InChIKey=CHUNZFVEPFJQIA-DAFXYXGESA-O
Data  3 KI
  Tab Delimited (TSV)   2D SDfile   Computed 3D by Vconf -m prep SDfile
Find this compound or compounds like it in BindingDB:
Activity Spreadsheet -- Enzyme Inhibition Constant Data from BindingDB
Found 3 hits for monomerid = 50074919
TargetPlasma kallikrein(Homo sapiens (Human))
The Procter & Gamble
Curated by ChEMBL
LigandPNGBDBM50074919(Morpholine-4-carboxylic acid [(R)-2,2-dimethyl-1-(...)
Affinity DataKi:  1.55E+4nM. Assay description: Inhibitory activity of compound against human plasma Kallikrein (PK)
In DepthDetails ArticlePubMed
TargetPlasminogen(Rattus norvegicus)
The Procter & Gamble
Curated by ChEMBL
LigandPNGBDBM50074919(Morpholine-4-carboxylic acid [(R)-2,2-dimethyl-1-(...)
Affinity DataKi:  1.10E+5nM. Assay description: Inhibitory activity of compound against Plasmin (HP)
In DepthDetails ArticlePubMed
TargetKallikrein-1(Homo sapiens (Human))
The Procter & Gamble
Curated by ChEMBL
LigandPNGBDBM50074919(Morpholine-4-carboxylic acid [(R)-2,2-dimethyl-1-(...)
Affinity DataKi: >1.50E+5nM. Assay description: Inhibitory activity of compound against Tissue Kallikrein (TK)
In DepthDetails ArticlePubMed