BDBM50075064 ((S)-2-Amino-3-methyl-butyryl)-sulfamic acid (2R,3S,4R,5R)-3,4-dihydroxy-5-(4-phenyl-thiazol-2-yl)-tetrahydro-furan-2-ylmethyl ester::CHEMBL124856
SMILES CC(C)[C@H](N)C(=O)NS(=O)(=O)OC[C@H]1O[C@H]([C@H](O)[C@@H]1O)c1nc(cs1)-c1ccccc1
InChI Key InChIKey=RJHSJRODVBTGKT-ZHCJQAHYSA-N
Data  3 IC50
  Tab Delimited (TSV)   2D SDfile   Computed 3D by Vconf -m prep SDfile
Find this compound or compounds like it in BindingDB:
Activity Spreadsheet -- Enzyme Inhibition Constant Data from BindingDB
Found 3 hits for monomerid = 50075064
TargetIsoleucine--tRNA ligase, cytoplasmic(Homo sapiens (Human))
Cubist Pharmaceuticals
Curated by ChEMBL
LigandPNGBDBM50075064(((S)-2-Amino-3-methyl-butyryl)-sulfamic acid (2R,3...)
Affinity DataIC50:  1.50E+4nM. Assay description: Inhibition of E. coli isoleucyl-tRNA synthetase
In DepthDetails ArticlePubMed
TargetAlanine--tRNA ligase, cytoplasmic(Homo sapiens (Human))
Cubist Pharmaceuticals
Curated by ChEMBL
LigandPNGBDBM50075064(((S)-2-Amino-3-methyl-butyryl)-sulfamic acid (2R,3...)
Affinity DataIC50: >1.00E+5nM. Assay description: Compound tested for the inhibition of E. coli Alanine-tRNA synthetase
In DepthDetails ArticlePubMed
TargetLeucine--tRNA ligase, cytoplasmic(Homo sapiens (Human))
Cubist Pharmaceuticals
Curated by ChEMBL
LigandPNGBDBM50075064(((S)-2-Amino-3-methyl-butyryl)-sulfamic acid (2R,3...)
Affinity DataIC50:  1.40E+4nM. Assay description: Compound tested for the inhibition of E. coli Leucyl-tRNA synthetase
In DepthDetails ArticlePubMed