BDBM50075113 1,1-dimethyl-2-phenylcarboxamidopropanoic anhydride::CHEMBL134268
SMILES CC(C)(CNC(=O)c1ccccc1)C(=O)OC(=O)C(C)(C)CNC(=O)c1ccccc1
InChI Key InChIKey=HTMCLXGHJGHVGZ-UHFFFAOYSA-N
Data  5 IC50
  Tab Delimited (TSV)   2D SDfile   Computed 3D by Vconf -m prep SDfile
Find this compound or compounds like it in BindingDB:
Activity Spreadsheet -- Enzyme Inhibition Constant Data from BindingDB
Found 5 hits for monomerid = 50075113
TargetSerine protease 1(Homo sapiens (Human))
Nippon Steel
Curated by ChEMBL
LigandPNGBDBM50075113(1,1-dimethyl-2-phenylcarboxamidopropanoic anhydrid...)
Affinity DataIC50:  990nM. Assay description: Inhibitory activity against porcine pancreatic trypsin (TRP)
In DepthDetails ArticlePubMed
TargetChymase(Homo sapiens (Human))
Nippon Steel
Curated by ChEMBL
LigandPNGBDBM50075113(1,1-dimethyl-2-phenylcarboxamidopropanoic anhydrid...)
Affinity DataIC50:  3.00E+3nM. Assay description: Inhibitory activity against human chymase (h-chymase)
In DepthDetails ArticlePubMed
TargetChymotrypsinogen B(Homo sapiens (Human))
Nippon Steel
Curated by ChEMBL
LigandPNGBDBM50075113(1,1-dimethyl-2-phenylcarboxamidopropanoic anhydrid...)
Affinity DataIC50:  140nM. Assay description: Inhibitory activity against bovine pancreatic alpha-chymotrypsin (alpha-CT)
In DepthDetails ArticlePubMed
TargetChymotrypsin-like elastase family member 2A(Sus scrofa)
Nippon Steel
Curated by ChEMBL
LigandPNGBDBM50075113(1,1-dimethyl-2-phenylcarboxamidopropanoic anhydrid...)
Affinity DataIC50:  2.60E+3nM. Assay description: Inhibitory activity against porcine pancreatic elastase (PPE)
In DepthDetails ArticlePubMed
TargetCathepsin G(Homo sapiens (Human))
Nippon Steel
Curated by ChEMBL
LigandPNGBDBM50075113(1,1-dimethyl-2-phenylcarboxamidopropanoic anhydrid...)
Affinity DataIC50:  170nM. Assay description: Inhibitory activity against human leukocyte cathepsin G (h-CG)
In DepthDetails ArticlePubMed