BDBM50075152 (E)-3-(2-Chloro-4-hydroxy-phenyl)-N-[(S)-1-(5-methyl-4-oxo-4H-thieno[2,3-d][1,3]oxazin-2-yl)-ethyl]-acrylamide::CHEMBL138725
SMILES C[C@H](NC(=O)\C=C\c1ccc(O)cc1Cl)c1nc2scc(C)c2c(=O)o1
InChI Key InChIKey=PULUHVZDROWOMY-RWCYGVJQSA-N
Data  2 IC50
  Tab Delimited (TSV)   2D SDfile   Computed 3D by Vconf -m prep SDfile
Find this compound or compounds like it in BindingDB:
Activity Spreadsheet -- Enzyme Inhibition Constant Data from BindingDB
Found 2 hits for monomerid = 50075152
TargetCapsid scaffolding protein(Human herpesvirus 6A (strain Uganda-1102) (HHV-6 v...)
Smithkline Beecham Pharmaceuticals
Curated by ChEMBL
LigandPNGBDBM50075152((E)-3-(2-Chloro-4-hydroxy-phenyl)-N-[(S)-1-(5-meth...)
Affinity DataIC50:  15nM. Assay description: Inhibitory activity against Varicella Zoster Virus (VZV) protease was determined using quenched fluorescence assay
In DepthDetails ArticlePubMed
TargetCapsid scaffolding protein(Human herpesvirus 2 (strain HG52) (HHV-2) (Human h...)
Smithkline Beecham Pharmaceuticals
Curated by ChEMBL
LigandPNGBDBM50075152((E)-3-(2-Chloro-4-hydroxy-phenyl)-N-[(S)-1-(5-meth...)
Affinity DataIC50:  230nM. Assay description: Inhibitory activity against herpes simplex virus type 2 (HSV-2) protease was determined using quenched fluorescence assay
In DepthDetails ArticlePubMed