BDBM50075197 CHEMBL3414839
SMILES [Br-].C[N+](C)(CCCCNC(=O)c1cn(Cc2ccccc2)c2cc(Br)ccc2c1=O)CC#CCOC1=NOCC1
InChI Key InChIKey=QYYDQAIFMPQSHY-UHFFFAOYSA-O
Data  1 Kd  1 EC50
  Tab Delimited (TSV)   2D SDfile   Computed 3D by Vconf -m prep SDfile
Find this compound or compounds like it in BindingDB:
Activity Spreadsheet -- Enzyme Inhibition Constant Data from BindingDB
Found 2 hits for monomerid = 50075197
TargetMuscarinic acetylcholine receptor M1(Homo sapiens (Human))
University Of W£Rzburg
Curated by ChEMBL
LigandPNGBDBM50075197(CHEMBL3414839)
Affinity DataKd:  141nM. Assay description: Displacement of [3H]NMS from human muscarinic M1 acetylcholine receptor expressed in CHO cell membranes by radioligand binding assay
In DepthDetails ArticlePubMed
TargetMuscarinic acetylcholine receptor M1(Homo sapiens (Human))
University Of W£Rzburg
Curated by ChEMBL
LigandPNGBDBM50075197(CHEMBL3414839)
Affinity DataEC50:  63nM. Assay description: Partial agonist activity at human muscarinic M1 acetylcholine receptor expressed in CHO cells assessed as increase in IP1 accumulation incubated for ...
In DepthDetails ArticlePubMed