BDBM50075305 CHEMBL149279::[Difluoro-(4-phenylethynyl-phenyl)-methyl]-phosphonic acid
SMILES OP(O)(=O)C(F)(F)c1ccc(cc1)C#Cc1ccccc1
InChI Key InChIKey=HJLMKBKVGNJQSM-UHFFFAOYSA-N
Data  1 IC50
  Tab Delimited (TSV)   2D SDfile   Computed 3D by Vconf -m prep SDfile
Find this compound or compounds like it in BindingDB:
Activity Spreadsheet -- Enzyme Inhibition Constant Data from BindingDB
Found 1 hit for monomerid = 50075305
TargetTyrosine-protein phosphatase non-receptor type 1(Homo sapiens (Human))
Tokyo University Of Pharmacy & Life Science
Curated by ChEMBL
LigandPNGBDBM50075305(CHEMBL149279 | [Difluoro-(4-phenylethynyl-phenyl)-...)
Affinity DataIC50:  1.28E+5nM. Assay description: Inhibitory potency of the compound for the protein tyrosine phosphatase(PTP 1B)-catalyzed hydrolysis of p-nitrophenol phosphate
In DepthDetails ArticlePubMed