BDBM50075372 CHEMBL3414901
SMILES COc1cc(OC)c(cc1NC(=O)COCC(O)=O)S(=O)(=O)N1[C@@H](C)CCc2ccccc12
InChI Key InChIKey=SJFSUWJIKIBVTD-AWEZNQCLSA-N
Data  2 IC50
  Tab Delimited (TSV)   2D SDfile   Computed 3D by Vconf -m prep SDfile
Find this compound or compounds like it in BindingDB:
Activity Spreadsheet -- Enzyme Inhibition Constant Data from BindingDB
Found 2 hits for monomerid = 50075372
TargetBifunctional protein GlmU(Escherichia coli)
Csir-Indian Institute Of Integrative Medicine
Curated by ChEMBL
LigandPNGBDBM50075372(CHEMBL3414901)
Affinity DataIC50:  200nM. Assay description: Inhibition of Escherichia coli GlmU acetyltransferase activity assessed as coenzyme A production using acetyl CoA substrate
In DepthDetails ArticlePubMed
TargetBifunctional protein GlmU(Escherichia coli)
Csir-Indian Institute Of Integrative Medicine
Curated by ChEMBL
LigandPNGBDBM50075372(CHEMBL3414901)
Affinity DataIC50:  200nM. Assay description: Inhibition of Escherichia coli GlmU acetyltransferase activity assessed as coenzyme A production using acetyl CoA substrate
In DepthDetails ArticlePubMed