BDBM50075386 CHEMBL3415069
SMILES COc1cc(OC)c(cc1NC(=O)[C@@H]1[C@@H](C)[C@H]1C(O)=O)S(=O)(=O)N1[C@@H](C)CCc2ccccc12
InChI Key InChIKey=ZXGLREMHQRTJAV-XBKVZVGVSA-N
Data  2 IC50
  Tab Delimited (TSV)   2D SDfile   Computed 3D by Vconf -m prep SDfile
Find this compound or compounds like it in BindingDB:
Activity Spreadsheet -- Enzyme Inhibition Constant Data from BindingDB
Found 2 hits for monomerid = 50075386
TargetBifunctional protein GlmU(Escherichia coli)
Csir-Indian Institute Of Integrative Medicine
Curated by ChEMBL
LigandPNGBDBM50075386(CHEMBL3415069)
Affinity DataIC50:  400nM. Assay description: Inhibition of Escherichia coli GlmU acetyltransferase activity assessed as coenzyme A production using acetyl CoA substrate
In DepthDetails ArticlePubMed
TargetBifunctional protein GlmU(Escherichia coli)
Csir-Indian Institute Of Integrative Medicine
Curated by ChEMBL
LigandPNGBDBM50075386(CHEMBL3415069)
Affinity DataIC50:  400nM. Assay description: Inhibition of Escherichia coli GlmU acetyltransferase activity assessed as coenzyme A production using acetyl CoA substrate
In DepthDetails ArticlePubMed