BDBM50075783 4-[5-(4-Chloro-phenyl)-3-(5-chloro-2-propoxy-phenyl)-1H-pyrrol-2-yl]-pyridine::CHEMBL155686
SMILES CCCOc1ccc(Cl)cc1-c1cc([nH]c1-c1ccncc1)-c1ccc(Cl)cc1
InChI Key InChIKey=LAVFRHVGDMNZAT-UHFFFAOYSA-N
Data  4 IC50
  Tab Delimited (TSV)   2D SDfile   Computed 3D by Vconf -m prep SDfile
Find this compound or compounds like it in BindingDB:
Activity Spreadsheet -- Enzyme Inhibition Constant Data from BindingDB
Found 4 hits for monomerid = 50075783
TargetGlucagon receptor(Mus musculus)
Merck Research Laboratories
Curated by ChEMBL
LigandPNGBDBM50075783(4-[5-(4-Chloro-phenyl)-3-(5-chloro-2-propoxy-pheny...)
Affinity DataIC50:  50nM. Assay description: Binding affinity towards glucagon receptor determined by reduction in binding of [125I]-glucagon to the murine glucagon receptor (GGR) expressed on C...
In DepthDetails ArticlePubMed
TargetGlucagon receptor(Homo sapiens (Human))
Merck Research Laboratories
Curated by ChEMBL
LigandPNGBDBM50075783(4-[5-(4-Chloro-phenyl)-3-(5-chloro-2-propoxy-pheny...)
Affinity DataIC50:  170nM. Assay description: Binding affinity towards glucagon receptor determined by reduction in binding of [125I]-glucagon to the human glucagon receptor (GGR) expressed on CH...
In DepthDetails ArticlePubMed
TargetGlucagon receptor(Mus musculus)
Merck Research Laboratories
Curated by ChEMBL
LigandPNGBDBM50075783(4-[5-(4-Chloro-phenyl)-3-(5-chloro-2-propoxy-pheny...)
Affinity DataIC50:  1.00E+3nM. Assay description: Binding affinity towards glucagon receptor determined by reduction in binding of [125I]-glucagon to the human glucagon receptor (GGR) expressed on CH...
In DepthDetails ArticlePubMed
TargetGlucagon receptor(Homo sapiens (Human))
Merck Research Laboratories
Curated by ChEMBL
LigandPNGBDBM50075783(4-[5-(4-Chloro-phenyl)-3-(5-chloro-2-propoxy-pheny...)
Affinity DataIC50:  6nM. Assay description: Binding affinity determined by reduction in binding of 125 I-glucagon to the human glucagon receptor expressed on CHO cells in absence of Mg+2
In DepthDetails ArticlePubMed