BDBM50075786 4-[5-(4-Chloro-phenyl)-3-(2-methoxy-phenyl)-1H-pyrrol-2-yl]-pyridine::CHEMBL160380
SMILES COc1ccccc1-c1cc([nH]c1-c1ccncc1)-c1ccc(Cl)cc1
InChI Key InChIKey=SLQCVRWWFLMARF-UHFFFAOYSA-N
Data  5 IC50
  Tab Delimited (TSV)   2D SDfile   Computed 3D by Vconf -m prep SDfile
Find this compound or compounds like it in BindingDB:
Activity Spreadsheet -- Enzyme Inhibition Constant Data from BindingDB
Found 5 hits for monomerid = 50075786
TargetGlucagon receptor(Mus musculus)
Merck Research Laboratories
Curated by ChEMBL
LigandPNGBDBM50075786(4-[5-(4-Chloro-phenyl)-3-(2-methoxy-phenyl)-1H-pyr...)
Affinity DataIC50:  400nM. Assay description: Binding affinity towards glucagon receptor determined by reduction in binding of [125I]-glucagon to the murine glucagon receptor (GGR) expressed on C...
In DepthDetails ArticlePubMed
TargetMitogen-activated protein kinase 14(Homo sapiens (Human))
Merck Research Laboratories
Curated by ChEMBL
LigandPNGBDBM50075786(4-[5-(4-Chloro-phenyl)-3-(2-methoxy-phenyl)-1H-pyr...)
Affinity DataIC50:  2.65E+3nM. Assay description: Inhibitory activity against p38-alpha kinase
In DepthDetails ArticlePubMed
TargetGlucagon receptor(Homo sapiens (Human))TBA
LigandPNGBDBM50075786(4-[5-(4-Chloro-phenyl)-3-(2-methoxy-phenyl)-1H-pyr...)
Affinity DataIC50:  2.66E+3nM. Assay description: Antagonist activity at human glucagon receptor
In DepthDetails Article
TargetGlucagon receptor(Homo sapiens (Human))TBA
LigandPNGBDBM50075786(4-[5-(4-Chloro-phenyl)-3-(2-methoxy-phenyl)-1H-pyr...)
Affinity DataIC50:  500nM. Assay description: Binding affinity determined by reduction in binding of 125 I-glucagon to the human glucagon receptor expressed on CHO cells in absence of Mg+2
In DepthDetails ArticlePubMed
TargetGlucagon receptor(Homo sapiens (Human))TBA
LigandPNGBDBM50075786(4-[5-(4-Chloro-phenyl)-3-(2-methoxy-phenyl)-1H-pyr...)
Affinity DataIC50:  70nM. Assay description: Binding affinity determined by reduction in binding of 125 I-glucagon to the human glucagon receptor expressed on CHO cells in absence of Mg+2
In DepthDetails ArticlePubMed