BDBM50075830 3-(Acetyl-hydroxy-amino)-2-benzyl-propionic acid::CHEMBL161820
SMILES CC(=O)N(O)CC(Cc1ccccc1)C(O)=O
InChI Key InChIKey=UWUIRLDVHDDVLT-UHFFFAOYSA-N
Data  1 KI
  Tab Delimited (TSV)   2D SDfile   Computed 3D by Vconf -m prep SDfile
Find this compound or compounds like it in BindingDB:
Activity Spreadsheet -- Enzyme Inhibition Constant Data from BindingDB
Found 1 hit for monomerid = 50075830
TargetCarboxypeptidase A1(Homo sapiens (Human))
Pohang University Of Science And Technology
Curated by ChEMBL
LigandPNGBDBM50075830(3-(Acetyl-hydroxy-amino)-2-benzyl-propionic acid |...)
Affinity DataKi:  5.90E+3nM. Assay description: Compound was tested for its inhibitory activity against carboxypeptidase A (CPA)
In DepthDetails ArticlePubMed