BDBM50075956 CHEMBL3415789
SMILES OC(=O)C([O-])=O.C[NH+](CC#C)CC(=C)Cc1ccc(F)c(F)c1
InChI Key InChIKey=IMQOHHJKSAHJQM-UHFFFAOYSA-O
Data  4 IC50
  Tab Delimited (TSV)   2D SDfile   Computed 3D by Vconf -m prep SDfile
Find this compound or compounds like it in BindingDB:
Activity Spreadsheet -- Enzyme Inhibition Constant Data from BindingDB
Found 4 hits for monomerid = 50075956
TargetAmine oxidase [flavin-containing] B(Homo sapiens (Human))
A* Star
Curated by ChEMBL
LigandPNGBDBM50075956(CHEMBL3415789)
Affinity DataIC50:  130nM. Assay description: Inhibition of human recombinant MAO-B expressed in Sf9 cells using 5-phenylacetaldehyde substrate assessed as hydrogen peroxide production after 1 hr...
In DepthDetails ArticlePubMed
TargetAmine oxidase [flavin-containing] A(Homo sapiens (Human))
A* Star
Curated by ChEMBL
LigandPNGBDBM50075956(CHEMBL3415789)
Affinity DataIC50:  34nM. Assay description: Inhibition of human recombinant MAO-A expressed in Sf9 cells using 5-hydroxytryptamine substrate assessed as hydrogen peroxide production after 1 hr ...
In DepthDetails ArticlePubMed
TargetAmine oxidase [flavin-containing] B(Rattus norvegicus (rat))
A* Star
Curated by ChEMBL
LigandPNGBDBM50075956(CHEMBL3415789)
Affinity DataIC50:  1.00E+3nM. Assay description: Inhibition of rat brain MAO-B in nuclei-free homogenates using [14C]phenylacetaldehyde substrate after 20 mins by liquid scintillation counting
In DepthDetails ArticlePubMed
TargetAmine oxidase [flavin-containing] A(Rattus norvegicus (rat))
A* Star
Curated by ChEMBL
LigandPNGBDBM50075956(CHEMBL3415789)
Affinity DataIC50:  100nM. Assay description: Inhibition of rat brain MAO-A in nuclei-free homogenates using [14C]hydroxytryptamine substrate after 20 mins by liquid scintillation counting
In DepthDetails ArticlePubMed