BDBM50076042 (S)-2-({(3S,6S,9aS)-6-[(S)-2-(9H-Fluoren-9-ylmethoxycarbonylamino)-3-mercapto-propionylamino]-5-oxo-octahydro-pyrrolo[1,2-a]azepine-3-carbonyl}-amino)-4-methylsulfanyl-butyric acid::CHEMBL170843
SMILES CSCC[C@H](NC(=O)[C@@H]1CC[C@@H]2CCC[C@H](NC(=O)[C@@H](CS)NC(=O)OCC3c4ccccc4-c4ccccc34)C(=O)N12)C(O)=O
InChI Key InChIKey=CJBARQMSFUNNQA-JCHJKKGQSA-N
Data  1 IC50
  Tab Delimited (TSV)   2D SDfile   Computed 3D by Vconf -m prep SDfile
Find this compound or compounds like it in BindingDB:
Activity Spreadsheet -- Enzyme Inhibition Constant Data from BindingDB
Found 1 hit for monomerid = 50076042
TargetSqualene synthase(Homo sapiens (Human))
Cold Spring Harbor Laboratory
Curated by ChEMBL
LigandPNGBDBM50076042((S)-2-({(3S,6S,9aS)-6-[(S)-2-(9H-Fluoren-9-ylmetho...)
Affinity DataIC50:  7.00E+3nM. Assay description: Compound was evaluated for concentration that caused 50% inhibition of yeast Farnesyltransferase (expressed as a GST fusion protein in E. coli)
In DepthDetails ArticlePubMed