BDBM50076134 (S)-2-({5-[(1H-Imidazol-4-ylmethyl)-amino]-biphenyl-2-carbonyl}-amino)-4-methyl-pentanoic acid methyl ester::CHEMBL26637
SMILES COC(=O)[C@H](CC(C)C)NC(=O)c1ccc(NCc2cnc[nH]2)cc1-c1ccccc1
InChI Key InChIKey=MNBIAKJXJPWZGD-QFIPXVFZSA-N
Data  1 IC50
  Tab Delimited (TSV)   2D SDfile   Computed 3D by Vconf -m prep SDfile
Find this compound or compounds like it in BindingDB:
Activity Spreadsheet -- Enzyme Inhibition Constant Data from BindingDB
Found 1 hit for monomerid = 50076134
LigandPNGBDBM50076134((S)-2-({5-[(1H-Imidazol-4-ylmethyl)-amino]-bipheny...)
Affinity DataIC50: >3.00E+4nM. Assay description: In vivo for inhibition of farnesylation based on the inhibition of H-Ras processing.
In DepthDetails ArticlePubMed