BDBM50076294 1-Acetyl-piperidine-4-carboxylic acid (2-benzo[1,3]dioxol-5-yl-ethyl)-{(2S,3S)-3-[2-(3-chloro-phenoxy)-acetylamino]-2-hydroxy-4-phenyl-butyl}-amide::CHEMBL290115
SMILES CC(=O)N1CCC(CC1)C(=O)N(CCc1ccc2OCOc2c1)C[C@H](O)[C@H](Cc1ccccc1)NC(=O)COc1cccc(Cl)c1
InChI Key InChIKey=JZFCZNJOQYIEAF-CONSDPRKSA-N
Data  2 KI
  Tab Delimited (TSV)   2D SDfile   Computed 3D by Vconf -m prep SDfile
Find this compound or compounds like it in BindingDB:
Activity Spreadsheet -- Enzyme Inhibition Constant Data from BindingDB
Found 2 hits for monomerid = 50076294
TargetCathepsin D(Homo sapiens (Human))
University Of California
Curated by ChEMBL
LigandPNGBDBM50076294(1-Acetyl-piperidine-4-carboxylic acid (2-benzo[1,3...)
Affinity DataKi:  1.90nM. Assay description: Compound was tested for the inhibitory activity against human liver cathepsin D
In DepthDetails ArticlePubMed
TargetPlasmepsin II(Plasmodium falciparum)
University Of California
Curated by ChEMBL
LigandPNGBDBM50076294(1-Acetyl-piperidine-4-carboxylic acid (2-benzo[1,3...)
Affinity DataKi:  4nM. Assay description: Inhibitory activity against Plasmepsin 2
In DepthDetails ArticlePubMed