BDBM50076328 CHEMBL3416335
SMILES [Cl-].CNc1nc(-c2ccccc2)[n+](s1)-c1ccccc1
InChI Key InChIKey=FFUBTEITUNMMOK-UHFFFAOYSA-O
Data  5 IC50
  Tab Delimited (TSV)   2D SDfile   Computed 3D by Vconf -m prep SDfile
Find this compound or compounds like it in BindingDB:
Activity Spreadsheet -- Enzyme Inhibition Constant Data from BindingDB
Found 5 hits for monomerid = 50076328
TargetHistone acetyltransferase GCN5(Saccharomyces cerevisiae S288c)
Mayo Clinic
Curated by ChEMBL
LigandPNGBDBM50076328(CHEMBL3416335)
Affinity DataIC50:  2.70E+3nM. Assay description: Inhibition of Vps75-stimulated recombinant Saccharomyces cerevisiae histone acetyltransferase Rtt109 using Asf1-dH3-H4 as substrate assessed as coenz...
In DepthDetails ArticlePubMed
TargetHistone acetyltransferase GCN5(Saccharomyces cerevisiae S288c)
Mayo Clinic
Curated by ChEMBL
LigandPNGBDBM50076328(CHEMBL3416335)
Affinity DataIC50:  9.10E+3nM. Assay description: Inhibition of Vps75-stimulated recombinant Saccharomyces cerevisiae histone acetyltransferase Rtt109 using Asf1-dH3-H4 as substrate assessed as coenz...
In DepthDetails ArticlePubMed
TargetHistone acetyltransferase GCN5(Saccharomyces cerevisiae S288c)
Mayo Clinic
Curated by ChEMBL
LigandPNGBDBM50076328(CHEMBL3416335)
Affinity DataIC50:  7.50E+3nM. Assay description: Inhibition of yeast histone acetyltransferase Gcn5-Ada2-Ada3 complex using tetramer and [3H]-acetyl-CoA assessed as acetate incorporation after 30 mi...
In DepthDetails ArticlePubMed
TargetHistone acetyltransferase p300(Homo sapiens (Human))
Mayo Clinic
Curated by ChEMBL
LigandPNGBDBM50076328(CHEMBL3416335)
Affinity DataIC50:  1.90E+3nM. Assay description: Inhibition of recombinant histone acetyltransferase p300 (unknown origin) using dH3-H4 tetramer and [3H]-acetyl-CoA assessed as acetate incorporation...
In DepthDetails ArticlePubMed
TargetHistone acetyltransferase GCN5(Saccharomyces cerevisiae S288c)
Mayo Clinic
Curated by ChEMBL
LigandPNGBDBM50076328(CHEMBL3416335)
Affinity DataIC50:  810nM. Assay description: Inhibition of Vps75-stimulated recombinant Saccharomyces cerevisiae histone acetyltransferase Rtt109 using [3H]-acetyl-CoA assessed as acetate incorp...
In DepthDetails ArticlePubMed