BDBM50076370 (S)-N,N-Dimethyl-3-phenyl-2-[3-(5-thioxo-4,5-dihydro-[1,3,4]thiadiazol-2-yl)-ureido]-propionamide::CHEMBL40034
SMILES CN(C)C(=O)[C@H](Cc1ccccc1)NC(=O)Nc1nnc(S)s1
InChI Key InChIKey=LUPLBSDRRWYFTC-JTQLQIEISA-N
Data  4 KI
  Tab Delimited (TSV)   2D SDfile   Computed 3D by Vconf -m prep SDfile
Find this compound or compounds like it in BindingDB:
Activity Spreadsheet -- Enzyme Inhibition Constant Data from BindingDB
Found 4 hits for monomerid = 50076370
TargetStromelysin-1(Homo sapiens (Human))
Pharmacia And Upjohn
Curated by ChEMBL
LigandPNGBDBM50076370((S)-N,N-Dimethyl-3-phenyl-2-[3-(5-thioxo-4,5-dihyd...)
Affinity DataKi:  2.30E+3nM. Assay description: Binding affinity for matrix metalloproteinase-3
In DepthDetails ArticlePubMed
TargetStromelysin-1(Homo sapiens (Human))
Pharmacia And Upjohn
Curated by ChEMBL
LigandPNGBDBM50076370((S)-N,N-Dimethyl-3-phenyl-2-[3-(5-thioxo-4,5-dihyd...)
Affinity DataKi:  2.30E+3nM. Assay description: Inhibition of human stromelysin-1 (MMP-3)
In DepthDetails ArticlePubMed
Target72 kDa type IV collagenase(Homo sapiens (Human))
University Of California San Francisco
Curated by ChEMBL
LigandPNGBDBM50076370((S)-N,N-Dimethyl-3-phenyl-2-[3-(5-thioxo-4,5-dihyd...)
Affinity DataKi:  2.26E+5nM. Assay description: Inhibition of human Matrix metalloproteinase-2 (gelatinase-A)
In DepthDetails ArticlePubMed
TargetInterstitial collagenase(Homo sapiens (Human))
Pharmacia And Upjohn
Curated by ChEMBL
LigandPNGBDBM50076370((S)-N,N-Dimethyl-3-phenyl-2-[3-(5-thioxo-4,5-dihyd...)
Affinity DataKi:  2.26E+5nM. Assay description: Binding affinity for matrix metalloproteinase-1
In DepthDetails ArticlePubMed