BDBM50076562 3-{5-[4-amino(imino)methylaminobutyl]-4,5-dihydro-3-isoxazolylcarboxamido}-2-(2,5-dichloro-3-thienylsulfonamido)-(2S)-propanoic acid::CHEMBL171840
SMILES NC(=N)NCCCCC1CC(=NO1)C(=O)NC[C@H](NS(=O)(=O)c1cc(Cl)sc1Cl)C(O)=O
InChI Key InChIKey=CWIPHYIYKWHCMO-HTLJXXAVSA-N
Data  2 IC50
  Tab Delimited (TSV)   2D SDfile   Computed 3D by Vconf -m prep SDfile
Find this compound or compounds like it in BindingDB:
Activity Spreadsheet -- Enzyme Inhibition Constant Data from BindingDB
Found 2 hits for monomerid = 50076562
TargetIntegrin alpha-IIb/beta-3(Homo sapiens (Human))
Dupont Pharmaceuticals
Curated by ChEMBL
LigandPNGBDBM50076562(3-{5-[4-amino(imino)methylaminobutyl]-4,5-dihydro-...)
Affinity DataIC50:  1.90E+3nM. Assay description: Antagonistic activity against vitronectin receptor
In DepthDetails ArticlePubMed
TargetIntegrin alpha-V/beta-3(Homo sapiens (Human))
Dupont Pharmaceuticals
Curated by ChEMBL
LigandPNGBDBM50076562(3-{5-[4-amino(imino)methylaminobutyl]-4,5-dihydro-...)
Affinity DataIC50:  24nM. Assay description: Antagonistic activity against vitronectin receptor
In DepthDetails ArticlePubMed