BDBM50076682 CHEMBL6678::Sodium; (2S,3S,5R,6R)-6-hydroxymethyl-3-(methoxyimino-methyl)-3-methyl-4,4,7-trioxo-4lambda*6*-thia-1-aza-bicyclo[3.2.0]heptane-2-carboxylate
SMILES CO\N=C\[C@@]1(C)[C@@H](N2[C@@H]([C@H](CO)C2=O)S1(=O)=O)C([O-])=O
InChI Key InChIKey=FQSPFOVCHGZCIK-YOMQDVOZSA-M
Data  2 IC50
  Tab Delimited (TSV)   2D SDfile   Computed 3D by Vconf -m prep SDfile
Find this compound or compounds like it in BindingDB:
Activity Spreadsheet -- Enzyme Inhibition Constant Data from BindingDB
Found 2 hits for monomerid = 50076682
TargetBeta-lactamase TEM(Escherichia coli)
Wyeth-Ayerst Research
Curated by ChEMBL
LigandPNGBDBM50076682(CHEMBL6678 | Sodium; (2S,3S,5R,6R)-6-hydroxymethyl...)
Affinity DataIC50:  64nM. Assay description: Inhibitory activity of the compound against TEM-1 (class A) beta-lactamase
In DepthDetails ArticlePubMed
TargetBeta-lactamase(Escherichia coli)
Wyeth-Ayerst Research
Curated by ChEMBL
LigandPNGBDBM50076682(CHEMBL6678 | Sodium; (2S,3S,5R,6R)-6-hydroxymethyl...)
Affinity DataIC50:  280nM. Assay description: Inhibitory activity of the compound against AmpC (class C) beta-lactamase
In DepthDetails ArticlePubMed