BDBM50076797 CHEMBL10955::Lithium; (S)-2-{[2'-methyl-5-(5-phenyl-furan-2-ylmethoxymethyl)-biphenyl-2-carbonyl]-amino}-4-methylsulfanyl-butyrate
SMILES CSCC[C@H](NC(=O)c1ccc(COCc2ccc(o2)-c2ccccc2)cc1-c1ccccc1C)C([O-])=O
InChI Key InChIKey=JFUPLVLXDDNRLK-NDEPHWFRSA-M
Data  1 IC50  1 EC50
  Tab Delimited (TSV)   2D SDfile   Computed 3D by Vconf -m prep SDfile
Find this compound or compounds like it in BindingDB:
Activity Spreadsheet -- Enzyme Inhibition Constant Data from BindingDB
Found 2 hits for monomerid = 50076797
LigandPNGBDBM50076797(CHEMBL10955 | Lithium; (S)-2-{[2'-methyl-5-(5-phen...)
Affinity DataEC50: >1nM. Assay description: EC50 is measured as inhibition of ras processing in a whole cell assay for farnesyltransferase (FTase)
In DepthDetails ArticlePubMed
LigandPNGBDBM50076797(CHEMBL10955 | Lithium; (S)-2-{[2'-methyl-5-(5-phen...)
Affinity DataIC50:  6nM. Assay description: In vitro inhibitory activity of the compound was evaluated against farnesyltransferase (FTase)
In DepthDetails ArticlePubMed