BDBM50076974 CHEMBL3416703
SMILES COC(=O)[C@H](CCCCN)NC(=O)c1ccc(N)c(N)c1
InChI Key InChIKey=NWMMOGWPQJFLIW-LBPRGKRZSA-N
Data  2 IC50
  Tab Delimited (TSV)   2D SDfile   Computed 3D by Vconf -m prep SDfile
Find this compound or compounds like it in BindingDB:
Activity Spreadsheet -- Enzyme Inhibition Constant Data from BindingDB
Found 2 hits for monomerid = 50076974
TargetEndoplasmic reticulum aminopeptidase 1(Homo sapiens (Human))
National Center For Scientific Research&Quot;Demokritos&Quot
Curated by ChEMBL
LigandPNGBDBM50076974(CHEMBL3416703)
Affinity DataIC50: >1.00E+5nM. Assay description: Inhibition of human recombinant ERAP1 expressed in baculovirus infected Sf9 cells using L-leucine-7-amido-4-methyl coumarin as substrate after 5 to 1...
In DepthDetails ArticlePubMed
TargetLeucyl-cystinyl aminopeptidase(Homo sapiens (Human))
National Center For Scientific Research&Quot;Demokritos&Quot
Curated by ChEMBL
LigandPNGBDBM50076974(CHEMBL3416703)
Affinity DataIC50: >1.00E+5nM. Assay description: Inhibition of human recombinant IRAP expressed in baculovirus infected cabbage looper ovary Hi5 cells using L-leucine-7-amido-4-methyl coumarin as su...
In DepthDetails ArticlePubMed