BDBM50077031 CHEMBL3416695
SMILES CC(C)[C@H](NC(=O)c1ccc(N)c(NC(=O)[C@@H](N)CCCNC(N)=N)c1)C(O)=O
InChI Key InChIKey=XQKJTIQPTVHBOT-JSGCOSHPSA-N
Data  2 IC50
  Tab Delimited (TSV)   2D SDfile   Computed 3D by Vconf -m prep SDfile
Find this compound or compounds like it in BindingDB:
Activity Spreadsheet -- Enzyme Inhibition Constant Data from BindingDB
Found 2 hits for monomerid = 50077031
TargetEndoplasmic reticulum aminopeptidase 2(Homo sapiens (Human))
National Center For Scientific Research&Quot;Demokritos&Quot
Curated by ChEMBL
LigandPNGBDBM50077031(CHEMBL3416695)
Affinity DataIC50:  5.00E+3nM. Assay description: Inhibition of human recombinant ERAP2 expressed in baculovirus infected cabbage looper ovary Hi5 cells using L-arginyl-7-amido-4-methyl coumarin as s...
In DepthDetails ArticlePubMed
TargetLeucyl-cystinyl aminopeptidase(Homo sapiens (Human))
National Center For Scientific Research&Quot;Demokritos&Quot
Curated by ChEMBL
LigandPNGBDBM50077031(CHEMBL3416695)
Affinity DataIC50:  3.30E+3nM. Assay description: Inhibition of human recombinant IRAP expressed in baculovirus infected cabbage looper ovary Hi5 cells using L-leucine-7-amido-4-methyl coumarin as su...
In DepthDetails ArticlePubMed