BDBM50077052 1N-(2-{1-[3-benzo[d][1,3]thiazol-2-yl-2-(3,3-dimethyl-1,2,3,4-tetrahydro-8-quinolinylsulfonamido)propanoyl]hexahydro-4-pyridinyl}ethyl)-aminomethylsulfonamide::CHEMBL28334
SMILES CNS(=O)(=O)NCCC1CCN(CC1)C(=O)[C@H](Cc1nc2ccccc2s1)NS(=O)(=O)c1cccc2CC(C)(C)CNc12
InChI Key InChIKey=XOUKZBXUTNQETL-QHCPKHFHSA-N
Data  1 KI
  Tab Delimited (TSV)   2D SDfile   Computed 3D by Vconf -m prep SDfile
Find this compound or compounds like it in BindingDB:
Activity Spreadsheet -- Enzyme Inhibition Constant Data from BindingDB
Found 1 hit for monomerid = 50077052
TargetProthrombin(Homo sapiens (Human))
Novartis Horsham Research Center
Curated by ChEMBL
LigandPNGBDBM50077052(1N-(2-{1-[3-benzo[d][1,3]thiazol-2-yl-2-(3,3-dimet...)
Affinity DataKi:  119nM. Assay description: Inhibition of human thrombin (in vitro)
In DepthDetails ArticlePubMed