BDBM50077127 CHEMBL3416731
SMILES COC(=O)[C@H](CCCCN)NC(=O)c1ccc(NC(=O)[C@@H](N)CCCNC(N)=N)c(N)c1
InChI Key InChIKey=MZDQTENBSHOAEA-BBRMVZONSA-N
Data  2 IC50
  Tab Delimited (TSV)   2D SDfile   Computed 3D by Vconf -m prep SDfile
Find this compound or compounds like it in BindingDB:
Activity Spreadsheet -- Enzyme Inhibition Constant Data from BindingDB
Found 2 hits for monomerid = 50077127
TargetLeucyl-cystinyl aminopeptidase(Homo sapiens (Human))
National Center For Scientific Research&Quot;Demokritos&Quot
Curated by ChEMBL
LigandPNGBDBM50077127(CHEMBL3416731)
Affinity DataIC50:  4.90E+3nM. Assay description: Inhibition of human recombinant IRAP expressed in baculovirus infected cabbage looper ovary Hi5 cells using L-leucine-7-amido-4-methyl coumarin as su...
In DepthDetails ArticlePubMed
TargetEndoplasmic reticulum aminopeptidase 2(Homo sapiens (Human))
National Center For Scientific Research&Quot;Demokritos&Quot
Curated by ChEMBL
LigandPNGBDBM50077127(CHEMBL3416731)
Affinity DataIC50:  1.18E+4nM. Assay description: Inhibition of human recombinant ERAP2 expressed in baculovirus infected cabbage looper ovary Hi5 cells using L-arginyl-7-amido-4-methyl coumarin as s...
In DepthDetails ArticlePubMed