BDBM50077525 ((4Z,7Z,10Z,13Z)-Nonadeca-4,7,10,13-tetraenyl)-carbamic acid 2-fluoro-ethyl ester::CHEMBL61341
SMILES CCCCC\C=C/C\C=C/C\C=C/C\C=C/CCCNC(=O)OCCF
InChI Key InChIKey=DXPTYLHBGODTLP-DOFZRALJSA-N
Data  1 KI
  Tab Delimited (TSV)   2D SDfile   Computed 3D by Vconf -m prep SDfile
Find this compound or compounds like it in BindingDB:
Activity Spreadsheet -- Enzyme Inhibition Constant Data from BindingDB
Found 1 hit for monomerid = 50077525
TargetCannabinoid receptor 1(Rattus norvegicus (rat))
Organix
Curated by ChEMBL
LigandPNGBDBM50077525(((4Z,7Z,10Z,13Z)-Nonadeca-4,7,10,13-tetraenyl)-car...)
Affinity DataKi:  331nM. Assay description: The compound was tested for Ki value against rat whole brain P2 membrane preparation in presence of enzyme inhibitor PMSF.
In DepthDetails ArticlePubMed