BDBM50077730 CHEMBL284498::N-{(S)-1-[(S)-1-((S)-1-Carbamoyl-2-phenyl-ethylcarbamoyl)-4-guanidino-butylcarbamoyl]-2-cyclohexyl-ethyl}-nicotinamide
SMILES NC(=N)NCCC[C@H](NC(=O)[C@H](CC1CCCCC1)NC(=O)c1cccnc1)C(=O)N[C@@H](Cc1ccccc1)C(N)=O
InChI Key InChIKey=FJPCONHYUPALMZ-SDHOMARFSA-N
Data  1 IC50  1 EC50
  Tab Delimited (TSV)   2D SDfile   Computed 3D by Vconf -m prep SDfile
Find this compound or compounds like it in BindingDB:
Activity Spreadsheet -- Enzyme Inhibition Constant Data from BindingDB
Found 2 hits for monomerid = 50077730
TargetProteinase-activated receptor 1(Homo sapiens (Human))
The R. W. Johnson Pharmaceutical Research Institute
Curated by ChEMBL
LigandPNGBDBM50077730(CHEMBL284498 | N-{(S)-1-[(S)-1-((S)-1-Carbamoyl-2-...)
Affinity DataIC50:  1.30E+3nM. Assay description: Activation of human platelet aggregation (gel-filtered platelets) induced by alpha thrombin
In DepthDetails ArticlePubMed
TargetProteinase-activated receptor 1(Homo sapiens (Human))
The R. W. Johnson Pharmaceutical Research Institute
Curated by ChEMBL
LigandPNGBDBM50077730(CHEMBL284498 | N-{(S)-1-[(S)-1-((S)-1-Carbamoyl-2-...)
Affinity DataEC50:  2.00E+3nM. Assay description: Activation of human platelet aggregation (gel-filtered platelets) induced by alpha thrombin
In DepthDetails ArticlePubMed