BDBM50077762 Benzofuran-2-carboxylic acid {(S)-1-[(S)-1-((S)-1-carbamoyl-2-phenyl-ethylcarbamoyl)-4-guanidino-butylcarbamoyl]-2-cyclohexyl-ethyl}-amide::CHEMBL285915
SMILES NC(=N)NCCC[C@H](NC(=O)[C@H](CC1CCCCC1)NC(=O)c1cc2ccccc2o1)C(=O)N[C@@H](Cc1ccccc1)C(N)=O
InChI Key InChIKey=RIZMYQPZIRYCQC-GSDHBNRESA-N
Data  1 IC50  1 EC50
  Tab Delimited (TSV)   2D SDfile   Computed 3D by Vconf -m prep SDfile
Find this compound or compounds like it in BindingDB:
Activity Spreadsheet -- Enzyme Inhibition Constant Data from BindingDB
Found 2 hits for monomerid = 50077762
TargetProteinase-activated receptor 1(Homo sapiens (Human))
The R. W. Johnson Pharmaceutical Research Institute
Curated by ChEMBL
LigandPNGBDBM50077762(Benzofuran-2-carboxylic acid {(S)-1-[(S)-1-((S)-1-...)
Affinity DataIC50:  3.00E+3nM. Assay description: Inhibition of [3H]-S-(p-F-Phe)-Har-L-Har-KY-NH2 binding to thrombin receptor (PAR-1) on membranes from CHRF cells
In DepthDetails ArticlePubMed
TargetProteinase-activated receptor 1(Homo sapiens (Human))
The R. W. Johnson Pharmaceutical Research Institute
Curated by ChEMBL
LigandPNGBDBM50077762(Benzofuran-2-carboxylic acid {(S)-1-[(S)-1-((S)-1-...)
Affinity DataEC50:  1.25E+4nM. Assay description: Activation of human platelet aggregation (gel-filtered platelets) induced by alpha thrombin
In DepthDetails ArticlePubMed