BDBM50077901 CHEMBL3417056::US9611229, 51
SMILES CC(=O)N1CCN(CCNc2cn(nn2)-c2ccc(Cl)c(Cl)c2)CC1
InChI Key InChIKey=XAGAEJWVAGEOND-UHFFFAOYSA-N
Data  2 KI
  Tab Delimited (TSV)   2D SDfile   Computed 3D by Vconf -m prep SDfile
Find this compound or compounds like it in BindingDB:
Activity Spreadsheet -- Enzyme Inhibition Constant Data from BindingDB
Found 2 hits for monomerid = 50077901
TargetSigma non-opioid intracellular receptor 1(Mus musculus (Mouse))
Laboratorios Del Dr. Esteve
US Patent
LigandPNGBDBM50077901(CHEMBL3417056 | US9611229, 51)
Affinity DataKi:  275nM. Assay description: Brain membrane preparation and binding assays for the 61-receptor were performed as described (DeHaven-Hudkins, D. L., L. C. Fleissner, and F. Y. For...
In DepthDetails US Patent
TargetSigma non-opioid intracellular receptor 1(Homo sapiens (Human))
Esteve
Curated by ChEMBL
LigandPNGBDBM50077901(CHEMBL3417056 | US9611229, 51)
Affinity DataKi:  275nM. Assay description: Displacement of [3H](+)-pentazocine from human sigma 1 receptor transfected in HEK293 cells after 120 mins by liquid scintillation counting
In DepthDetails ArticlePubMed