BDBM50078055 CHEMBL3417412
SMILES CCNc1nc(no1)C1(CCC1)c1ccc(cc1)-c1cnc(N)nc1
InChI Key InChIKey=MQLQQLIKTRETRP-UHFFFAOYSA-N
Data  2 IC50
  Tab Delimited (TSV)   2D SDfile   Computed 3D by Vconf -m prep SDfile
Find this compound or compounds like it in BindingDB:
Activity Spreadsheet -- Enzyme Inhibition Constant Data from BindingDB
Found 2 hits for monomerid = 50078055
TargetArachidonate 5-lipoxygenase-activating protein(Homo sapiens (Human))
Boehringer Ingelheim Pharmaceuticals
Curated by ChEMBL
LigandPNGBDBM50078055(CHEMBL3417412)
Affinity DataIC50:  460nM. Assay description: Inhibition of FLAP in calcimycin-stimulated human whole blood assessed as inhibition of LTB4 synthesis preincubated for 15 mins followed by calcimyci...
In DepthDetails ArticlePubMed
TargetArachidonate 5-lipoxygenase-activating protein(Homo sapiens (Human))
Boehringer Ingelheim Pharmaceuticals
Curated by ChEMBL
LigandPNGBDBM50078055(CHEMBL3417412)
Affinity DataIC50:  11nM. Assay description: Displacement of [125I]-L-691831 from human FLAP expressed in insect SF9 cell membranes after 2 hrs by Topcount analysis
In DepthDetails ArticlePubMed