BDBM50078087 (S)-6-[2-(4-Amino-phenyl)-ethyl]-3-(2-tert-butyl-4-hydroxymethyl-5-methyl-phenylsulfanyl)-4-hydroxy-6-isopropyl-5,6-dihydro-pyran-2-one::6-[2-(4-Amino-phenyl)-ethyl]-3-(2-tert-butyl-4-hydroxymethyl-5-methyl-phenylsulfanyl)-4-hydroxy-6-isopropyl-5,6-dihydro-pyran-2-one::CHEMBL285759::CI-1029
SMILES CC(C)[C@]1(CCc2ccc(N)cc2)CC(=O)C(Sc2cc(C)c(CO)cc2C(C)(C)C)C(=O)O1
InChI Key InChIKey=YDZPKVMVMXBCHP-NMXAJACMSA-N
Data  1 KI  1 IC50
  Tab Delimited (TSV)   2D SDfile   Computed 3D by Vconf -m prep SDfile
Find this compound or compounds like it in BindingDB:
Activity Spreadsheet -- Enzyme Inhibition Constant Data from BindingDB
Found 2 hits for monomerid = 50078087
TargetGag-Pol polyprotein [489-587](Human immunodeficiency virus type 1)
Warner-Lambert
Curated by ChEMBL
LigandPNGBDBM50078087((S)-6-[2-(4-Amino-phenyl)-ethyl]-3-(2-tert-butyl-4...)
Affinity DataKi:  0.110nMpH: 6.2Assay Description:In vitro binding affinity of the compound against HIV protease at pH 6.2 was determined
In DepthDetails ArticlePubMed
TargetGag-Pol polyprotein [489-587](Human immunodeficiency virus type 1)
Warner-Lambert
Curated by ChEMBL
LigandPNGBDBM50078087((S)-6-[2-(4-Amino-phenyl)-ethyl]-3-(2-tert-butyl-4...)
Affinity DataIC50:  0.110nM. Assay description: HIV-1 protease inhibition.
In DepthDetails ArticlePubMed