BDBM50078118 CHEMBL3417524
SMILES CN(C)C(=O)Cn1cc(cn1)-c1nc(no1)[C@](C)(C1CC1)c1ccc(cc1)-c1ccc(N)nc1
InChI Key InChIKey=AKHAUJKTKYSPFH-VWLOTQADSA-N
Data  2 IC50
  Tab Delimited (TSV)   2D SDfile   Computed 3D by Vconf -m prep SDfile
Find this compound or compounds like it in BindingDB:
Activity Spreadsheet -- Enzyme Inhibition Constant Data from BindingDB
Found 2 hits for monomerid = 50078118
TargetArachidonate 5-lipoxygenase-activating protein(Homo sapiens (Human))
Boehringer Ingelheim Pharmaceuticals
Curated by ChEMBL
LigandPNGBDBM50078118(CHEMBL3417524)
Affinity DataIC50:  1.10nM. Assay description: Displacement of [125I]-L-691831 from human FLAP expressed in insect SF9 cell membranes after 2 hrs by Topcount analysis
In DepthDetails ArticlePubMed
TargetArachidonate 5-lipoxygenase-activating protein(Homo sapiens (Human))
Boehringer Ingelheim Pharmaceuticals
Curated by ChEMBL
LigandPNGBDBM50078118(CHEMBL3417524)
Affinity DataIC50:  66nM. Assay description: Inhibition of FLAP in calcimycin-stimulated human whole blood assessed as inhibition of LTB4 synthesis preincubated for 15 mins followed by calcimyci...
In DepthDetails ArticlePubMed