BDBM50078198 CHEMBL3417743
SMILES COc1ccc(Oc2cccc(c2)S(=O)(=O)C2(CCC3(C2)CCNCC3)C(=O)NO)cc1
InChI Key InChIKey=GCMYZCWWNHCRJP-UHFFFAOYSA-N
Data  2 IC50
  Tab Delimited (TSV)   2D SDfile   Computed 3D by Vconf -m prep SDfile
Find this compound or compounds like it in BindingDB:
Activity Spreadsheet -- Enzyme Inhibition Constant Data from BindingDB
Found 2 hits for monomerid = 50078198
TargetStromelysin-2(Homo sapiens (Human))
University Of Navarra
Curated by ChEMBL
LigandPNGBDBM50078198(CHEMBL3417743)
Affinity DataIC50:  189nM. Assay description: Inhibition of MMP-10 (unknown origin) measured every minute for 1 hr by fluorescence assay
In DepthDetails ArticlePubMed
TargetStromelysin-1(Homo sapiens (Human))
University Of Navarra
Curated by ChEMBL
LigandPNGBDBM50078198(CHEMBL3417743)
Affinity DataIC50:  178nM. Assay description: Inhibition of MMP-3 (unknown origin) measured every minute for 1 hr by fluorescence assay
In DepthDetails ArticlePubMed