BDBM50078301 2-Cyano-N-[(1R,2S)-2-(2-cyano-5-fluoro-phenoxy)-1-methyl-2-phenyl-ethyl]-butyramide::CHEMBL289381
SMILES CCC(C#N)C(=O)N[C@H](C)[C@@H](Oc1cc(F)ccc1C#N)c1ccccc1
InChI Key InChIKey=UWIQGACVUDOUBJ-GMOTXPODSA-N
Data  1 KI
  Tab Delimited (TSV)   2D SDfile   Computed 3D by Vconf -m prep SDfile
Find this compound or compounds like it in BindingDB:
Activity Spreadsheet -- Enzyme Inhibition Constant Data from BindingDB
Found 1 hit for monomerid = 50078301
TargetScytalone dehydratase(Magnaporthe grisea)
Fmc Stine Research Center
Curated by ChEMBL
LigandPNGBDBM50078301(2-Cyano-N-[(1R,2S)-2-(2-cyano-5-fluoro-phenoxy)-1-...)
Affinity DataKi:  0.0210nM. Assay description: Inhibition of scytalone dehydratase purified from Magnaporthe grisea
In DepthDetails ArticlePubMed