BDBM50078332 (2S,4R,5S,6S)-5-Acetylamino-2,4-dihydroxy-6-((1R,2R)-1,2,3-trihydroxy-propyl)-tetrahydro-pyran-2-carboxylic acid::CHEMBL307262
SMILES CC(=O)N[C@H]1[C@H](O)C[C@](O)(O[C@@H]1[C@H](O)[C@H](O)CO)C(O)=O
InChI Key InChIKey=SQVRNKJHWKZAKO-DTJAAUDXSA-N
Data  1 IC50
  Tab Delimited (TSV)   2D SDfile   Computed 3D by Vconf -m prep SDfile
Find this compound or compounds like it in BindingDB:
Activity Spreadsheet -- Enzyme Inhibition Constant Data from BindingDB
Found 1 hit for monomerid = 50078332
TargetNeuraminidase(Influenza A virus (A/Puerto Rico/8/34/Mount Sinai(...)
University Of Alabama At Birmingham
Curated by ChEMBL
LigandPNGBDBM50078332((2S,4R,5S,6S)-5-Acetylamino-2,4-dihydroxy-6-((1R,2...)
Affinity DataIC50:  1.00E+4nM. Assay description: In vitro inhibitory activity of the compound against H1N9 Influenza A Neuraminidase.
In DepthDetails ArticlePubMed