BDBM50078413 CHEMBL3414743
SMILES Cn1cc(cn1)-c1cc(F)c2nnc(Cc3ccc4ncc(O)cc4c3)n2c1
InChI Key InChIKey=QWXKGCDEWNJQJC-UHFFFAOYSA-N
Data  1 IC50
  Tab Delimited (TSV)   2D SDfile   Computed 3D by Vconf -m prep SDfile
Find this compound or compounds like it in BindingDB:
Activity Spreadsheet -- Enzyme Inhibition Constant Data from BindingDB
Found 1 hit for monomerid = 50078413
TargetHepatocyte growth factor receptor(Homo sapiens (Human))
Amgen
Curated by ChEMBL
LigandPNGBDBM50078413(CHEMBL3414743)
Affinity DataIC50:  51nM. Assay description: Inhibition of recombinant c-Met kinase domain (unknown origin) incubated for 30 mins using gastrin peptide substrate by HTRF assay
In DepthDetails ArticlePubMed